�l����,�\������,���l,�N��,���Z��,Q1,Q2,Q2,Q2,Q2,Q2,Q2,Q2,Q3,Q3,Q3,Q3,Q4,Q5,Q6,Q6,Q6,Q6,Q6,Q7,Q7,Q7,Q8,Q8,Q8,Q9,Q10,Q11,Q11,Q11,Q12,Q13,Q14,Q14,Q14,Q14,Q14,Q15,Q16,Q16,Q16,Q16,Q16,Q17,Q18,Q19,Q20,Q21,Q22,Q22,Q22,Q22,Q22,Q28
�ߘa�T�N�x���΃��|�o�^�Ҍ����A���P�[�g,2024/1/29 17:17,,50��,�΋�,������,���̑�(�܂��o�^�����΂���),,,,,,,���΃��|�̎d�g�݂�o�^���@�E������@�Ȃǂ𒼐ڋ����Ă��炦��i���΃��|�����A�s���o�O�u���Ȃǁj,,,,,,,,,,,,,,,,,,,,,,,,,,,,,,,,,,,�ǂ��炩�Ƃ����΂����d�g�݂��Ǝv��,���Ԃ�����ΎQ��������,�ǂ��炩�Ƃ����΂����d�g�݂��Ǝv��,�ǂ��炩�Ƃ����Εω��͂Ȃ�����,�g�������Ƃ��Ȃ���Q23��,,,,,,"�����o�^���܂����B
���オ�y���݂ł��B"
�ߘa�T�N�x���΃��|�o�^�Ҍ����A���P�[�g,2024/1/29 12:00,,50��,�΋�,������,���|�[�g���鎞�Ԃ��Ȃ�,,,,,,,���T�����炦��i�L�O�i��s�̎{�ݗ��p���Ȃǁj,,,,,,,,,,,,,,,,,,,,,,,,,,,,,,,,,,,�ǂ��炩�Ƃ����΂����d�g�݂��Ǝv��,�������Ȃ�,�ǂ��炩�Ƃ����΂����d�g�݂��Ǝv��,�ω��͂Ȃ�����,�g�������Ƃ��Ȃ���Q23��,,,,,,
�ߘa�T�N�x���΃��|�o�^�Ҍ����A���P�[�g,2024/1/29 6:37,,50��,��t��,������,���|�[�g���鎞�Ԃ��Ȃ�,,,,,,,���T�����炦��i�L�O�i��s�̎{�ݗ��p���Ȃǁj,,,,,,,,,,,,,,,,,,,,,,,,,,,,,,,,,,,�����d�g�݂��Ǝv��,���Ԃ�����ΎQ��������,�����d�g�݂��Ǝv��,�ǂ��炩�Ƃ����Εω���������,�ǂ��炩�Ƃ����Ύg���₷����Q23��,,,,,,
�ߘa�T�N�x���΃��|�o�^�Ҍ����A���P�[�g,2024/1/28 23:54,,�`10��,���l��,������,���|�[�g���Ă������̂Ȃ̂������ł͔��f���Â炢,,,,,,,���΃��|�̎d�g�݂�o�^���@�E������@�Ȃǂ𒼐ڋ����Ă��炦��i���΃��|�����A�s���o�O�u���Ȃǁj,,,,,,,,,,,,,,,,,,,,,,,,,,,,,,,,,,,�����d�g�݂��Ǝv��,���Ԃ�����ΎQ��������,�����d�g�݂��Ǝv��,�ǂ��炩�Ƃ����Εω���������,�ǂ��炩�Ƃ����Ύg���₷����Q23��,,,,,,���̊����������ƍL�����Ă����Ɨǂ��Ǝv���܂��I�I
�ߘa�T�N�x���΃��|�o�^�Ҍ����A���P�[�g,2024/1/28 22:12,,50��,���l��,������,�ړI��d�g�݂��悭�킩��Ȃ�,���|�[�g���@��������Ȃ�,���|�[�g���邱�Ƃ��ʓ|,,,,,���΃��|�̎d�g�݂�o�^���@�E������@�Ȃǂ𒼐ڋ����Ă��炦��i���΃��|�����A�s���o�O�u���Ȃǁj,���T�����炦��i�L�O�i��s�̎{�ݗ��p���Ȃǁj,,,,,,,,,,,,,,,,,,,,,,,,,,,,,,,,,,�����d�g�݂��Ǝv��,���Ԃ�����ΎQ��������,�����d�g�݂��Ǝv��,�ǂ��炩�Ƃ����Εω���������,�g�������Ƃ��Ȃ���Q23��,,,,,,�^�p����ł͂ƂĂ��ǂ��d�g�݂��Ǝv���܂��B
�ߘa�T�N�x���΃��|�o�^�Ҍ����A���P�[�g,2024/1/28 21:01,,60��,�Ԍ����,������,���|�[�g���@��������Ȃ�,���|�[�g���邱�Ƃ��ʓ|,,,,,,���΃��|�̎d�g�݂�o�^���@�E������@�Ȃǂ𒼐ڋ����Ă��炦��i���΃��|�����A�s���o�O�u���Ȃǁj,,,,,,,,,,,,,,,,,,,,,,,,,,,,,,,,,,,�����d�g�݂��Ǝv��,���Ԃ�����ΎQ��������,�����d�g�݂��Ǝv��,�ǂ��炩�Ƃ����Εω���������,�ǂ��炩�Ƃ����Ύg���ɂ���,�g�������킩��Â炢,���|�[�g���̓��͍��ڂ�����,,,,
�ߘa�T�N�x���΃��|�o�^�Ҍ����A���P�[�g,2024/1/28 18:47,,50��,�Ԍ����,������,���|�[�g���@��������Ȃ�,���|�[�g���Ă������̂Ȃ̂������ł͔��f���Â炢,,,,,,���΃��|�̎d�g�݂�o�^���@�E������@�Ȃǂ𒼐ڋ����Ă��炦��i���΃��|�����A�s���o�O�u���Ȃǁj,���T�����炦��i�L�O�i��s�̎{�ݗ��p���Ȃǁj,,,,,,,,,,,,,,,,,,,,,,,,,,,,,,,,,,�����d�g�݂��Ǝv��,���Ԃ�����ΎQ��������,�����d�g�݂��Ǝv��,�ǂ��炩�Ƃ����Εω��͂Ȃ�����,�g�������Ƃ��Ȃ���Q23��,,,,,,
�ߘa�T�N�x���΃��|�o�^�Ҍ����A���P�[�g,2024/1/28 18:04,,70��ȏ�,��t��,������,���|�[�g���@��������Ȃ�,,,,,,,���T�����炦��i�L�O�i��s�̎{�ݗ��p���Ȃǁj,,,,,,,,,,,,,,,,,,,,,,,,,,,,,,,,,,,�����d�g�݂��Ǝv��,���Ԃ�����ΎQ��������,�����d�g�݂��Ǝv��,�ǂ��炩�Ƃ����Εω���������,�ǂ��炩�Ƃ����Ύg���₷����Q23��,,,,,,
�ߘa�T�N�x���΃��|�o�^�Ҍ����A���P�[�g,2024/1/28 16:50,,70��ȏ�,���l��,�͂���Q4��,,,,,,,,,,,,��������Q8��,,,,,,,,,,���|�[�g���@��������Ȃ�,���|�[�g���Ă������̂Ȃ̂������ł͔��f���Â炢,,��������Q13��,,,,,,������,���|�[�g���@���킩��Ȃ�,���|�[�g���Ă������̂Ȃ̂������ł͔��f���Â炢,,,,������,���|�[�g���@���킩��Ȃ�,���|�[�g���Ă������̂Ȃ̂������ł͔��f���Â炢,,,,�����d�g�݂��Ǝv��,���Ԃ�����ΎQ��������,�����d�g�݂��Ǝv��,�ǂ��炩�Ƃ����Εω���������,�ǂ��炩�Ƃ����Ύg���₷����Q23��,,,,,,
�ߘa�T�N�x���΃��|�o�^�Ҍ����A���P�[�g,2024/1/28 13:01,,50��,������,�͂���Q4��,,,,,,,,,,,,�͂�,�ǂ��炩�Ƃ����Ζ���,���|�[�g�����ۑ�ւ̑Ή��󋵂��킩��,���|�[�g�ɑ΂��Ďs��������R�����g�̕ԐM������,,,,,,,,,,��������Q13��,,,,,,�͂���Q15��,,,,,,������,���|�[�g���Ă������̂Ȃ̂������ł͔��f���Â炢,,,,,�����d�g�݂��Ǝv��,���Ԃ�����ΎQ��������,�����d�g�݂��Ǝv��,�ω���������,�g���₷����Q23��,,,,,,
�ߘa�T�N�x���΃��|�o�^�Ҍ����A���P�[�g,2024/1/28 9:37,,60��,��ы�,�͂���Q4��,,,,,,,,,,,,�͂�,����,���|�[�g�����ۑ�ɑ΂��Ă�����ƑΉ�����,,,,,,,,,,,��������Q13��,,,,,,������,�e�[�}���|�[�g������Ă��邱�Ƃ�m��Ȃ�����,,,,,�͂���Q17��,,,,,,�����d�g�݂��Ǝv��,�Q��������,�����d�g�݂��Ǝv��,�ω���������,�g���₷����Q23��,,,,,,"�����A�_��ɑΉ����Ă��������A��Ϗ������Ă܂��B
���ǂ��X�Â�����A������Q���������Ǝv���܂��B
��낵�����肢�������܂��B"
�ߘa�T�N�x���΃��|�o�^�Ҍ����A���P�[�g,2024/1/28 9:23,,70��ȏ�,������,�͂���Q4��,,,,,,,,,,,,��������Q8��,,,,,,,,,,���|�[�g���@��������Ȃ�,���|�[�g���Ă������̂Ȃ̂������ł͔��f���Â炢,,��������Q13��,,,,,,������,�ړI��d�g�݂��悭�킩��Ȃ�,���|�[�g���@���킩��Ȃ�,���|�[�g���Ă������̂Ȃ̂������ł͔��f���Â炢,���|�[�g���邱�Ƃ��ʓ|,,������,�ړI��d�g�݂��悭�킩��Ȃ�,���|�[�g���Ă������̂Ȃ̂������ł͔��f���Â炢,���������|�[�g��m��Ȃ�����,,,�����d�g�݂��Ǝv��,���Ԃ�����ΎQ��������,�����d�g�݂��Ǝv��,�ǂ��炩�Ƃ����Εω��͂Ȃ�����,�g�������Ƃ��Ȃ���Q23��,,,,,,�Ƃ��ɖ���
�ߘa�T�N�x���΃��|�o�^�Ҍ����A���P�[�g,2024/1/27 18:57,,60��,���l��,������,�ړI��d�g�݂��悭�킩��Ȃ�,,,,,,,�������߃X�|�b�g�̏Љ�Ȃǂ̊y�����R���e���c������,,,,,,,,,,,,,,,,,,,,,,,,,,,,,,,,,,,�ǂ��炩�Ƃ����΂����d�g�݂��Ǝv��,���Ԃ�����ΎQ��������,�ǂ��炩�Ƃ����΂����d�g�݂��Ǝv��,�ǂ��炩�Ƃ����Εω��͂Ȃ�����,�ǂ��炩�Ƃ����Ύg���₷����Q23��,,,,,,
�ߘa�T�N�x���΃��|�o�^�Ҍ����A���P�[�g,2024/1/27 16:46,,70��ȏ�,��ы�,������,�ړI��d�g�݂��悭�킩��Ȃ�,,,,,,,�������߃X�|�b�g�̏Љ�Ȃǂ̊y�����R���e���c������,,,,,,,,,,,,,,,,,,,,,,,,,,,,,,,,,,,�ǂ��炩�Ƃ����΂����d�g�݂��Ǝv��,���Ԃ�����ΎQ��������,�ǂ��炩�Ƃ����΂����d�g�݂��Ǝv��,�ǂ��炩�Ƃ����Εω��͂Ȃ�����,�g�������Ƃ��Ȃ���Q23��,,,,,,
�ߘa�T�N�x���΃��|�o�^�Ҍ����A���P�[�g,2024/1/27 15:49,,70��ȏ�,��ы�,������,�ړI��d�g�݂��悭�킩��Ȃ�,���|�[�g���邱�Ƃ��ʓ|,,,,,,���΃��|�̎d�g�݂�o�^���@�E������@�Ȃǂ𒼐ڋ����Ă��炦��i���΃��|�����A�s���o�O�u���Ȃǁj,���T�����炦��i�L�O�i��s�̎{�ݗ��p���Ȃǁj,,,,,,,,,,,,,,,,,,,,,,,,,,,,,,,,,,�ǂ��炩�Ƃ����΂����d�g�݂��Ǝv��,���Ԃ�����ΎQ��������,�ǂ��炩�Ƃ����΂����d�g�݂��Ǝv��,�ǂ��炩�Ƃ����Εω���������,�ǂ��炩�Ƃ����Ύg���₷����Q23��,,,,,,
�ߘa�T�N�x���΃��|�o�^�Ҍ����A���P�[�g,2024/1/27 15:43,,30��,���l��,������,�ړI��d�g�݂��悭�킩��Ȃ�,,,,,,,���T�����炦��i�L�O�i��s�̎{�ݗ��p���Ȃǁj,,,,,,,,,,,,,,,,,,,,,,,,,,,,,,,,,,,�����d�g�݂��Ǝv��,���Ԃ�����ΎQ��������,�����d�g�݂��Ǝv��,�ǂ��炩�Ƃ����Εω���������,�g�������Ƃ��Ȃ���Q23��,,,,,,
�ߘa�T�N�x���΃��|�o�^�Ҍ����A���P�[�g,2024/1/27 14:47,,70��ȏ�,�Ԍ����,������,���̑�(�o�^�����΂��肾����),,,,,,,���T�����炦��i�L�O�i��s�̎{�ݗ��p���Ȃǁj,,,,,,,,,,,,,,,,,,,,,,,,,,,,,,,,,,,�����d�g�݂��Ǝv��,���Ԃ�����ΎQ��������,�����d�g�݂��Ǝv��,�ǂ��炩�Ƃ����Εω���������,�ǂ��炩�Ƃ����Ύg���₷����Q23��,,,,,,
�ߘa�T�N�x���΃��|�o�^�Ҍ����A���P�[�g,2024/1/27 14:32,,60��,������,�͂���Q4��,,,,,,,,,,,,��������Q8��,,,,,,,,,,���̑�(�{���A�o�^�������߁B),,,��������Q13��,,,,,,������,���̑�(�{���A�o�^�������߁B),,,,,������,���̑�(�{���A�o�^�������߁B),,,,,�����d�g�݂��Ǝv��,���Ԃ�����ΎQ��������,�����d�g�݂��Ǝv��,�ǂ��炩�Ƃ����Εω���������,�ǂ��炩�Ƃ����Ύg���₷����Q23��,,,,,,�{���A�o�^�������߁A���ꂩ�痘�p���Ă��������B
�ߘa�T�N�x���΃��|�o�^�Ҍ����A���P�[�g,2024/1/27 10:06,,50��,������,������,���|�[�g���@��������Ȃ�,,,,,,,���T�����炦��i�L�O�i��s�̎{�ݗ��p���Ȃǁj,,,,,,,,,,,,,,,,,,,,,,,,,,,,,,,,,,,�ǂ��炩�Ƃ����΂����d�g�݂��Ǝv��,�Q��������,�����d�g�݂��Ǝv��,�ǂ��炩�Ƃ����Εω��͂Ȃ�����,�g���ɂ���,�g�������킩��Â炢,,,,,
�ߘa�T�N�x���΃��|�o�^�Ҍ����A���P�[�g,2024/1/27 10:01,,50��,��t��,�͂���Q4��,,,,,,,,,,,,�͂�,�ǂ��炩�Ƃ����Εs����Q7��,,,,,,��t�܂ł̎��Ԃ��x������,�ۑ�ւ̑Ή����I���܂ł̎��Ԃ��x������,���|�[�g�����ۑ�ւ̑Ή��󋵂̕񍐂��Ȃ�,,,,��������Q13��,,,,,,������,�e�[�}���|�[�g������Ă��邱�Ƃ�m��Ȃ�����,,,,,������,���|�[�g����K�v���������Ȃ�,,,,,�����d�g�݂��Ǝv��,���Ԃ�����ΎQ��������,�����d�g�݂��Ǝv��,�ω���������,�g���₷����Q23��,,,,,,�Ή��Ɏ��Ԃ�������ꍇ�ȂǁA�i���󋵂�m�点�Ă����Ƃ����B
�ߘa�T�N�x���΃��|�o�^�Ҍ����A���P�[�g,2024/1/27 8:55,,30��,�Ԍ����,������,�ړI��d�g�݂��悭�킩��Ȃ�,,,,,,,���T�����炦��i�L�O�i��s�̎{�ݗ��p���Ȃǁj,,,,,,,,,,,,,,,,,,,,,,,,,,,,,,,,,,,�����d�g�݂��Ǝv��,���Ԃ�����ΎQ��������,�����d�g�݂��Ǝv��,�ω���������,�ǂ��炩�Ƃ����Ύg���₷����Q23��,,,,,,
�ߘa�T�N�x���΃��|�o�^�Ҍ����A���P�[�g,2024/1/26 22:29,,50��,��ы�,������,���|�[�g���鎞�Ԃ��Ȃ�,,,,,,,���T�����炦��i�L�O�i��s�̎{�ݗ��p���Ȃǁj,,,,,,,,,,,,,,,,,,,,,,,,,,,,,,,,,,,�ǂ��炩�Ƃ����΂����d�g�݂��Ǝv��,�Q���������Ȃ�,�ǂ��炩�Ƃ����΂����d�g�݂��Ǝv��,�ω��͂Ȃ�����,�ǂ��炩�Ƃ����Ύg���₷����Q23��,,,,,,
�ߘa�T�N�x���΃��|�o�^�Ҍ����A���P�[�g,2024/1/26 22:22,,60��,�Ԍ����,������,�ړI��d�g�݂��悭�킩��Ȃ�,,,,,,,���T�����炦��i�L�O�i��s�̎{�ݗ��p���Ȃǁj,,,,,,,,,,,,,,,,,,,,,,,,,,,,,,,,,,,�ǂ��炩�Ƃ����΂����d�g�݂��Ǝv��,���Ԃ�����ΎQ��������,�ǂ��炩�Ƃ����΂����d�g�݂��Ǝv��,�ǂ��炩�Ƃ����Εω��͂Ȃ�����,�ǂ��炩�Ƃ����Ύg���ɂ���,���쐫������,,,,,
�ߘa�T�N�x���΃��|�o�^�Ҍ����A���P�[�g,2024/1/26 18:13,,40��,��t��,������,�ړI��d�g�݂��悭�킩��Ȃ�,,,,,,,���΃��|�̎d�g�݂�o�^���@�E������@�Ȃǂ𒼐ڋ����Ă��炦��i���΃��|�����A�s���o�O�u���Ȃǁj,���T�����炦��i�L�O�i��s�̎{�ݗ��p���Ȃǁj,,,,,,,,,,,,,,,,,,,,,,,,,,,,,,,,,,�����d�g�݂��Ǝv��,���Ԃ�����ΎQ��������,�����d�g�݂��Ǝv��,�ω��͂Ȃ�����,�g�������Ƃ��Ȃ���Q23��,,,,,,
�ߘa�T�N�x���΃��|�o�^�Ҍ����A���P�[�g,2024/1/26 17:30,,70��ȏ�,��ы�,������,���|�[�g���@��������Ȃ�,,,,,,,���΃��|�̎d�g�݂�o�^���@�E������@�Ȃǂ𒼐ڋ����Ă��炦��i���΃��|�����A�s���o�O�u���Ȃǁj,,,,,,,,,,,,,,,,,,,,,,,,,,,,,,,,,,,�ǂ��炩�Ƃ����΂����d�g�݂��Ǝv��Ȃ�,���Ԃ�����ΎQ��������,�ǂ��炩�Ƃ����΂����d�g�݂��Ǝv��Ȃ�,�ǂ��炩�Ƃ����Εω��͂Ȃ�����,�ǂ��炩�Ƃ����Ύg���ɂ���,�g�������킩��Â炢,,,,,
�ߘa�T�N�x���΃��|�o�^�Ҍ����A���P�[�g,2024/1/26 16:51,,70��ȏ�,�Ԍ����,������,���|�[�g���@��������Ȃ�,,,,,,,���T�����炦��i�L�O�i��s�̎{�ݗ��p���Ȃǁj,,,,,,,,,,,,,,,,,,,,,,,,,,,,,,,,,,,�����d�g�݂��Ǝv��,���Ԃ�����ΎQ��������,�ǂ��炩�Ƃ����΂����d�g�݂��Ǝv��,�ǂ��炩�Ƃ����Εω���������,�ǂ��炩�Ƃ����Ύg���ɂ���,���쐫������,,,,,
�ߘa�T�N�x���΃��|�o�^�Ҍ����A���P�[�g,2024/1/26 16:27,,60��,��ы�,������,���|�[�g���鎞�Ԃ��Ȃ�,,,,,,,���΃��|�̎d�g�݂�o�^���@�E������@�Ȃǂ𒼐ڋ����Ă��炦��i���΃��|�����A�s���o�O�u���Ȃǁj,,,,,,,,,,,,,,,,,,,,,,,,,,,,,,,,,,,�ǂ��炩�Ƃ����΂����d�g�݂��Ǝv��,���Ԃ�����ΎQ��������,�ǂ��炩�Ƃ����΂����d�g�݂��Ǝv��,�ǂ��炩�Ƃ����Εω���������,�ǂ��炩�Ƃ����Ύg���₷����Q23��,,,,,,
�ߘa�T�N�x���΃��|�o�^�Ҍ����A���P�[�g,2024/1/26 13:43,,70��ȏ�,��t��,������,���|�[�g���@��������Ȃ�,���|�[�g���Ă������̂Ȃ̂������ł͔��f���Â炢,,,,,,���΃��|�̎d�g�݂�o�^���@�E������@�Ȃǂ𒼐ڋ����Ă��炦��i���΃��|�����A�s���o�O�u���Ȃǁj,�������߃X�|�b�g�̏Љ�Ȃǂ̊y�����R���e���c������,,,,,,,,,,,,,,,,,,,,,,,,,,,,,,,,,,�ǂ��炩�Ƃ����΂����d�g�݂��Ǝv��,���Ԃ�����ΎQ��������,�ǂ��炩�Ƃ����΂����d�g�݂��Ǝv��,�ǂ��炩�Ƃ����Εω���������,�g�������Ƃ��Ȃ���Q23��,,,,,,
�ߘa�T�N�x���΃��|�o�^�Ҍ����A���P�[�g,2024/1/26 12:54,,40��,��t�s�O,�͂���Q4��,,,,,,,,,,,,�͂�,�ǂ��炩�Ƃ����Ζ���,���|�[�g�����ۑ�ւ̑Ή��󋵂��킩��,���|�[�g�ɑ΂��Ďs��������R�����g�̕ԐM������,,,,,,,,,,�͂�,�ǂ��炩�Ƃ����Ζ���,����I��LINE���g���Ă���̂ŊȒP�Ƀ��|�[�g�ł���,,,,�͂���Q15��,,,,,,�͂���Q17��,,,,,,�����d�g�݂��Ǝv��,���Ԃ�����ΎQ��������,�����d�g�݂��Ǝv��,�ω���������,�ǂ��炩�Ƃ����Ύg���₷����Q23��,,,,,,
�ߘa�T�N�x���΃��|�o�^�Ҍ����A���P�[�g,2024/1/26 10:10,,60��,���l��,�͂���Q4��,,,,,,,,,,,,�͂�,����,���|�[�g�����ۑ�ɑ΂��Ă�����ƑΉ�����,,,,,,,,,,,��������Q13��,,,,,,�͂���Q15��,,,,,,������,�ړI��d�g�݂��悭�킩��Ȃ�,,,,,�����d�g�݂��Ǝv��,���Ԃ�����ΎQ��������,�����d�g�݂��Ǝv��,�ω���������,�g���₷����Q23��,,,,,,
�ߘa�T�N�x���΃��|�o�^�Ҍ����A���P�[�g,2024/1/26 9:17,,70��ȏ�,�΋�,������,���|�[�g���@��������Ȃ�,,,,,,,�������߃X�|�b�g�̏Љ�Ȃǂ̊y�����R���e���c������,,,,,,,,,,,,,,,,,,,,,,,,,,,,,,,,,,,�ǂ��炩�Ƃ����΂����d�g�݂��Ǝv��,���Ԃ�����ΎQ��������,�ǂ��炩�Ƃ����΂����d�g�݂��Ǝv��,�ǂ��炩�Ƃ����Εω��͂Ȃ�����,�ǂ��炩�Ƃ����Ύg���ɂ���,���쐫������,,,,,��t�V�e�B�|�C���g�Ƃ��Ε���WAON�J�[�h�̘A�g�葱�������G
�ߘa�T�N�x���΃��|�o�^�Ҍ����A���P�[�g,2024/1/26 8:40,,30��,������,�͂���Q4��,,,,,,,,,,,,�͂�,�ǂ��炩�Ƃ����Ζ���,���|�[�g�����ۑ�ɑ΂��Ă�����ƑΉ�����,���|�[�g�����ۑ�ւ̑Ή��󋵂��킩��,���|�[�g�ɑ΂��Ďs��������R�����g�̕ԐM������,,,,,,,,,�͂�,�ǂ��炩�Ƃ����Ζ���,���[�U�[�o�^���s�v�ŋC�y�Ƀ��|�[�g�ł���,����I��LINE���g���Ă���̂ŊȒP�Ƀ��|�[�g�ł���,,,�͂���Q15��,,,,,,�͂���Q17��,,,,,,�ǂ��炩�Ƃ����΂����d�g�݂��Ǝv��,�Q���������Ȃ�,�ǂ��炩�Ƃ����΂����d�g�݂��Ǝv��,�ǂ��炩�Ƃ����Εω���������,�g���ɂ���,���쐫������,���̑�(�c�O�Ȃ����������),,,,"���̃A�v���͎c�O�Ȃ����������d����
�J�ڂ��摜�\�����x��
�܊p�̎��g�݂�����ł�LINE�ł�����Ǝv���Ďd���Ȃ�"
�ߘa�T�N�x���΃��|�o�^�Ҍ����A���P�[�g,2024/1/26 0:32,,70��ȏ�,������,�͂���Q4��,,,,,,,,,,,,�͂�,�ǂ��炩�Ƃ����Εs����Q7��,,,,,,���|�[�g�����ۑ�ɑ΂��Ċ��҂����Ή������Ȃ�����,,,,,,��������Q13��,,,,,,������,���|�[�g���邱�Ƃ��ʓ|,���|�[�g�������Ǝv���悤�ȃe�[�}���Ȃ�,�e�[�}�ɂ��������Ⴊ������Ȃ�,,,������,�����ŉ����ł���ۑ肪������Ȃ�,,,,,�����d�g�݂��Ǝv��,���Ԃ�����ΎQ��������,�����d�g�݂��Ǝv��,�ǂ��炩�Ƃ����Εω���������,�ǂ��炩�Ƃ����Ύg���ɂ���,���쐫������,,,,,
�ߘa�T�N�x���΃��|�o�^�Ҍ����A���P�[�g,2024/1/25 22:47,,60��,��ы�,�͂���Q4��,,,,,,,,,,,,�͂�,�ǂ��炩�Ƃ����Ζ���,���|�[�g�����ۑ�ɑ΂��Ă�����ƑΉ�����,,,,,,,,,,,��������Q13��,,,,,,������,�e�[�}�ɂ��������Ⴊ������Ȃ�,,,,,������,�ړI��d�g�݂��悭�킩��Ȃ�,,,,,�����d�g�݂��Ǝv��,���Ԃ�����ΎQ��������,�ǂ��炩�Ƃ����΂����d�g�݂��Ǝv��,�ω��͂Ȃ�����,�ǂ��炩�Ƃ����Ύg���₷����Q23��,,,,,,
�ߘa�T�N�x���΃��|�o�^�Ҍ����A���P�[�g,2024/1/25 21:46,,70��ȏ�,��ы�,������,���|�[�g���Ă������̂Ȃ̂������ł͔��f���Â炢,,,,,,,���΃��|�̎d�g�݂�o�^���@�E������@�Ȃǂ𒼐ڋ����Ă��炦��i���΃��|�����A�s���o�O�u���Ȃǁj,���T�����炦��i�L�O�i��s�̎{�ݗ��p���Ȃǁj,�������߃X�|�b�g�̏Љ�Ȃǂ̊y�����R���e���c������,,,,,,,,,,,,,,,,,,,,,,,,,,,,,,,,,�ǂ��炩�Ƃ����΂����d�g�݂��Ǝv��,���Ԃ�����ΎQ��������,�����d�g�݂��Ǝv��,�ǂ��炩�Ƃ����Εω���������,�g���ɂ���,���̑�(�X�}�z�ɂ��Ƃ��̂Őڑ��ł��Ȃ�),,,,,�ڑ����ނ�������
�ߘa�T�N�x���΃��|�o�^�Ҍ����A���P�[�g,2024/1/25 21:03,,70��ȏ�,��ы�,������,�ړI��d�g�݂��悭�킩��Ȃ�,���|�[�g���鎞�Ԃ��Ȃ�,���|�[�g���@��������Ȃ�,���|�[�g���Ă������̂Ȃ̂������ł͔��f���Â炢,,,,���΃��|�̎d�g�݂�o�^���@�E������@�Ȃǂ𒼐ڋ����Ă��炦��i���΃��|�����A�s���o�O�u���Ȃǁj,,,,,,,,,,,,,,,,,,,,,,,,,,,,,,,,,,,�����d�g�݂��Ǝv��,���Ԃ�����ΎQ��������,�����d�g�݂��Ǝv��,�ǂ��炩�Ƃ����Εω���������,�ǂ��炩�Ƃ����Ύg���ɂ���,�g�������킩��Â炢,,,,,
�ߘa�T�N�x���΃��|�o�^�Ҍ����A���P�[�g,2024/1/25 18:18,,50��,���l��,������,���|�[�g���@��������Ȃ�,,,,,,,���T�����炦��i�L�O�i��s�̎{�ݗ��p���Ȃǁj,,,,,,,,,,,,,,,,,,,,,,,,,,,,,,,,,,,�����d�g�݂��Ǝv��,�Q���������Ȃ�,�����d�g�݂��Ǝv��,�ǂ��炩�Ƃ����Εω��͂Ȃ�����,�g�������Ƃ��Ȃ���Q23��,,,,,,�ʔ������g�݂��Ǝv���܂��B
�ߘa�T�N�x���΃��|�o�^�Ҍ����A���P�[�g,2024/1/25 17:49,,50��,���l��,������,�ړI��d�g�݂��悭�킩��Ȃ�,���|�[�g���邱�Ƃ��ʓ|,,,,,,���T�����炦��i�L�O�i��s�̎{�ݗ��p���Ȃǁj,,,,,,,,,,,,,,,,,,,,,,,,,,,,,,,,,,,�ǂ��炩�Ƃ����΂����d�g�݂��Ǝv��,�������Ȃ�,�ǂ��炩�Ƃ����΂����d�g�݂��Ǝv��,�ǂ��炩�Ƃ����Εω��͂Ȃ�����,�ǂ��炩�Ƃ����Ύg���ɂ���,��ʂ̃��C�A�E�g��f�U�C�������Â炢,,,,,
�ߘa�T�N�x���΃��|�o�^�Ҍ����A���P�[�g,2024/1/25 17:24,,60��,��ы�,������,���|�[�g���Ă������̂Ȃ̂������ł͔��f���Â炢,,,,,,,���΃��|�̎d�g�݂�o�^���@�E������@�Ȃǂ𒼐ڋ����Ă��炦��i���΃��|�����A�s���o�O�u���Ȃǁj,,,,,,,,,,,,,,,,,,,,,,,,,,,,,,,,,,,�����d�g�݂��Ǝv��,���Ԃ�����ΎQ��������,�����d�g�݂��Ǝv��,�ω���������,�ǂ��炩�Ƃ����Ύg���₷����Q23��,,,,,,
�ߘa�T�N�x���΃��|�o�^�Ҍ����A���P�[�g,2024/1/25 16:59,,50��,�Ԍ����,������,�ړI��d�g�݂��悭�킩��Ȃ�,���|�[�g���@��������Ȃ�,,,,,,���T�����炦��i�L�O�i��s�̎{�ݗ��p���Ȃǁj,,,,,,,,,,,,,,,,,,,,,,,,,,,,,,,,,,,�ǂ��炩�Ƃ����΂����d�g�݂��Ǝv��,�������Ȃ�,�ǂ��炩�Ƃ����΂����d�g�݂��Ǝv��,�ǂ��炩�Ƃ����Εω���������,�g�������Ƃ��Ȃ���Q23��,,,,,,
�ߘa�T�N�x���΃��|�o�^�Ҍ����A���P�[�g,2024/1/25 15:34,,70��ȏ�,��ы�,�͂���Q4��,,,,,,,,,,,,�͂�,����,���|�[�g�����ۑ�ɑ΂��Ă�����ƑΉ�����,��t�܂ł̎��Ԃ���������,�ۑ�ւ̑Ή����I���܂ł̎��Ԃ���������,���|�[�g�����ۑ�ւ̑Ή��󋵂��킩��,���|�[�g�ɑ΂��Ďs��������R�����g�̕ԐM������,,,,,,,��������Q13��,,,,,,�͂���Q15��,,,,,,�͂���Q17��,,,,,,�����d�g�݂��Ǝv��,�Q��������,�����d�g�݂��Ǝv��,�ω���������,�ǂ��炩�Ƃ����Ύg���₷����Q23��,,,,,,
�ߘa�T�N�x���΃��|�o�^�Ҍ����A���P�[�g,2024/1/25 13:33,,60��,�΋�,������,�ړI��d�g�݂��悭�킩��Ȃ�,,,,,,,���΃��|�̎d�g�݂�o�^���@�E������@�Ȃǂ𒼐ڋ����Ă��炦��i���΃��|�����A�s���o�O�u���Ȃǁj,���T�����炦��i�L�O�i��s�̎{�ݗ��p���Ȃǁj,,,,,,,,,,,,,,,,,,,,,,,,,,,,,,,,,,�ǂ��炩�Ƃ����΂����d�g�݂��Ǝv��,���Ԃ�����ΎQ��������,�ǂ��炩�Ƃ����΂����d�g�݂��Ǝv��,�ǂ��炩�Ƃ����Εω���������,�ǂ��炩�Ƃ����Ύg���ɂ���,�g�������킩��Â炢,,,,,
�ߘa�T�N�x���΃��|�o�^�Ҍ����A���P�[�g,2024/1/25 10:17,,60��,�Ԍ����,�͂���Q4��,,,,,,,,,,,,��������Q8��,,,,,,,,,,���|�[�g���@��������Ȃ�,,,��������Q13��,,,,,,������,���|�[�g���@���킩��Ȃ�,,,,,������,���|�[�g���@���킩��Ȃ�,,,,,�����d�g�݂��Ǝv��,���Ԃ�����ΎQ��������,�����d�g�݂��Ǝv��,�ǂ��炩�Ƃ����Εω��͂Ȃ�����,�ǂ��炩�Ƃ����Ύg���ɂ���,���|�[�g���̓��͍��ڂ�����,,,,,"���͍��ڂ��������܂��B
���̂��߂�I D����͂��Ă���̂��A�Ӗ���������܂���B"
�ߘa�T�N�x���΃��|�o�^�Ҍ����A���P�[�g,2024/1/25 1:42,,50��,��t��,������,�ړI��d�g�݂��悭�킩��Ȃ�,���|�[�g���鎞�Ԃ��Ȃ�,,,,,,���T�����炦��i�L�O�i��s�̎{�ݗ��p���Ȃǁj,,,,,,,,,,,,,,,,,,,,,,,,,,,,,,,,,,,�����d�g�݂��Ǝv��,���Ԃ�����ΎQ��������,�����d�g�݂��Ǝv��,�ǂ��炩�Ƃ����Εω��͂Ȃ�����,�g�������Ƃ��Ȃ���Q23��,,,,,,
�ߘa�T�N�x���΃��|�o�^�Ҍ����A���P�[�g,2024/1/24 21:16,,60��,�Ԍ����,�͂���Q4��,,,,,,,,,,,,��������Q8��,,,,,,,,,,�ړI��d�g�݂��悭�킩��Ȃ�,,,��������Q13��,,,,,,������,�ړI��d�g�݂��悭�킩��Ȃ�,,,,,������,�ړI��d�g�݂��悭�킩��Ȃ�,,,,,�ǂ��炩�Ƃ����΂����d�g�݂��Ǝv��,�Q��������,�ǂ��炩�Ƃ����΂����d�g�݂��Ǝv��,�ǂ��炩�Ƃ����Εω���������,�ǂ��炩�Ƃ����Ύg���₷����Q23��,,,,,,
�ߘa�T�N�x���΃��|�o�^�Ҍ����A���P�[�g,2024/1/24 21:15,,70��ȏ�,�΋�,������,���|�[�g���邱�Ƃ��ʓ|,,,,,,,���T�����炦��i�L�O�i��s�̎{�ݗ��p���Ȃǁj,�������߃X�|�b�g�̏Љ�Ȃǂ̊y�����R���e���c������,,,,,,,,,,,,,,,,,,,,,,,,,,,,,,,,,,�����d�g�݂��Ǝv��,���Ԃ�����ΎQ��������,�����d�g�݂��Ǝv��,�ω��͂Ȃ�����,�g�������Ƃ��Ȃ���Q23��,,,,,,
�ߘa�T�N�x���΃��|�o�^�Ҍ����A���P�[�g,2024/1/24 20:12,,50��,������,������,���|�[�g���@��������Ȃ�,���|�[�g���Ă������̂Ȃ̂������ł͔��f���Â炢,,,,,,���T�����炦��i�L�O�i��s�̎{�ݗ��p���Ȃǁj,�������߃X�|�b�g�̏Љ�Ȃǂ̊y�����R���e���c������,,,,,,,,,,,,,,,,,,,,,,,,,,,,,,,,,,�ǂ��炩�Ƃ����΂����d�g�݂��Ǝv��,�������Ȃ�,�ǂ��炩�Ƃ����΂����d�g�݂��Ǝv��,�ǂ��炩�Ƃ����Εω��͂Ȃ�����,�ǂ��炩�Ƃ����Ύg���ɂ���,�g�������킩��Â炢,,,,,"�d�g�݂�g������������Ȃ�
�܂��ǂ�Ȏ��Ɏg�����킩��Ȃ�"
�ߘa�T�N�x���΃��|�o�^�Ҍ����A���P�[�g,2024/1/24 17:45,,50��,��t��,������,���|�[�g����K�v���������Ȃ�,,,,,,,�������߃X�|�b�g�̏Љ�Ȃǂ̊y�����R���e���c������,,,,,,,,,,,,,,,,,,,,,,,,,,,,,,,,,,,�����d�g�݂��Ǝv��,���Ԃ�����ΎQ��������,�����d�g�݂��Ǝv��,�ǂ��炩�Ƃ����Εω���������,�g�������Ƃ��Ȃ���Q23��,,,,,,
�ߘa�T�N�x���΃��|�o�^�Ҍ����A���P�[�g,2024/1/24 13:30,,60��,������,������,���|�[�g���Ă������̂Ȃ̂������ł͔��f���Â炢,,,,,,,���T�����炦��i�L�O�i��s�̎{�ݗ��p���Ȃǁj,,,,,,,,,,,,,,,,,,,,,,,,,,,,,,,,,,,�ǂ��炩�Ƃ����΂����d�g�݂��Ǝv��,���Ԃ�����ΎQ��������,�ǂ��炩�Ƃ����΂����d�g�݂��Ǝv��,�ǂ��炩�Ƃ����Εω��͂Ȃ�����,�ǂ��炩�Ƃ����Ύg���₷����Q23��,,,,,,
�ߘa�T�N�x���΃��|�o�^�Ҍ����A���P�[�g,2024/1/24 13:17,,70��ȏ�,���l��,�͂���Q4��,,,,,,,,,,,,��������Q8��,,,,,,,,,,���|�[�g����ۑ肪�Ȃ�,,,��������Q13��,,,,,,������,���|�[�g����K�v���������Ȃ�,,,,,������,���������|�[�g��m��Ȃ�����,,,,,�����d�g�݂��Ǝv��,���Ԃ�����ΎQ��������,�����d�g�݂��Ǝv��,�ǂ��炩�Ƃ����Εω���������,�g�������Ƃ��Ȃ���Q23��,,,,,,
�ߘa�T�N�x���΃��|�o�^�Ҍ����A���P�[�g,2024/1/24 9:40,,50��,�΋�,������,�ړI��d�g�݂��悭�킩��Ȃ�,,,,,,,���΃��|�̎d�g�݂�o�^���@�E������@�Ȃǂ𒼐ڋ����Ă��炦��i���΃��|�����A�s���o�O�u���Ȃǁj,���T�����炦��i�L�O�i��s�̎{�ݗ��p���Ȃǁj,�������߃X�|�b�g�̏Љ�Ȃǂ̊y�����R���e���c������,,,,,,,,,,,,,,,,,,,,,,,,,,,,,,,,,�ǂ��炩�Ƃ����΂����d�g�݂��Ǝv��,���Ԃ�����ΎQ��������,�ǂ��炩�Ƃ����΂����d�g�݂��Ǝv��,�ω��͂Ȃ�����,�g�������Ƃ��Ȃ���Q23��,,,,,,
�ߘa�T�N�x���΃��|�o�^�Ҍ����A���P�[�g,2024/1/24 8:38,,60��,�Ԍ����,������,�ړI��d�g�݂��悭�킩��Ȃ�,���|�[�g���@��������Ȃ�,,,,,,���T�����炦��i�L�O�i��s�̎{�ݗ��p���Ȃǁj,,,,,,,,,,,,,,,,,,,,,,,,,,,,,,,,,,,�����d�g�݂��Ǝv��,���Ԃ�����ΎQ��������,�ǂ��炩�Ƃ����΂����d�g�݂��Ǝv��,�ǂ��炩�Ƃ����Εω���������,�g�������Ƃ��Ȃ���Q23��,,,,,,
�ߘa�T�N�x���΃��|�o�^�Ҍ����A���P�[�g,2024/1/23 23:39,,20��,��t��,������,���|�[�g����K�v���������Ȃ�,,,,,,,�\�����x������,�������߃X�|�b�g�̏Љ�Ȃǂ̊y�����R���e���c������,,,,,,,,,,,,,,,,,,,,,,,,,,,,,,,,,,�����d�g�݂��Ǝv��,���Ԃ�����ΎQ��������,�����d�g�݂��Ǝv��,�ǂ��炩�Ƃ����Εω���������,�ǂ��炩�Ƃ����Ύg���₷����Q23��,,,,,,
�ߘa�T�N�x���΃��|�o�^�Ҍ����A���P�[�g,2024/1/23 23:36,,50��,���l��,������,�ړI��d�g�݂��悭�킩��Ȃ�,���|�[�g���@��������Ȃ�,,,,,,���T�����炦��i�L�O�i��s�̎{�ݗ��p���Ȃǁj,,,,,,,,,,,,,,,,,,,,,,,,,,,,,,,,,,,�ǂ��炩�Ƃ����΂����d�g�݂��Ǝv��,���Ԃ�����ΎQ��������,�ǂ��炩�Ƃ����΂����d�g�݂��Ǝv��,�ǂ��炩�Ƃ����Εω���������,�ǂ��炩�Ƃ����Ύg���ɂ���,�g�������킩��Â炢,���|�[�g���̓��͍��ڂ�����,,,,
�ߘa�T�N�x���΃��|�o�^�Ҍ����A���P�[�g,2024/1/23 23:23,,50��,�΋�,������,���|�[�g���@��������Ȃ�,,,,,,,���΃��|�̎d�g�݂�o�^���@�E������@�Ȃǂ𒼐ڋ����Ă��炦��i���΃��|�����A�s���o�O�u���Ȃǁj,���T�����炦��i�L�O�i��s�̎{�ݗ��p���Ȃǁj,,,,,,,,,,,,,,,,,,,,,,,,,,,,,,,,,,�ǂ��炩�Ƃ����΂����d�g�݂��Ǝv��,���Ԃ�����ΎQ��������,�ǂ��炩�Ƃ����΂����d�g�݂��Ǝv��,�ǂ��炩�Ƃ����Εω��͂Ȃ�����,�ǂ��炩�Ƃ����Ύg���ɂ���,���쐫������,,,,,
�ߘa�T�N�x���΃��|�o�^�Ҍ����A���P�[�g,2024/1/23 22:44,,70��ȏ�,��t�s�O,�͂���Q4��,,,,,,,,,,,,��������Q8��,,,,,,,,,,���|�[�g���鎞�Ԃ��Ȃ�,,,��������Q13��,,,,,,������,�e�[�}���|�[�g������Ă��邱�Ƃ�m��Ȃ�����,,,,,�͂���Q17��,,,,,,�����d�g�݂��Ǝv��,���Ԃ�����ΎQ��������,�����d�g�݂��Ǝv��,�ω��͂Ȃ�����,�g�������Ƃ��Ȃ���Q23��,,,,,,��t�s�Ȋw�قŃ{�����e�B�A���������Ă���̂ł��Ε���WAON��Ⴂ�܂����B�@�Z�܂��́@���͂��A�s���s�ł��B�@��t�s�̐E���A�m���͗L�\�ł����A�s���s�̒m���́A�m�\�w�����Ⴗ���܂��A�E�����E�E�E�A���Ƃ����āB�@��t�s���s���s���z���������ė~�����I
�ߘa�T�N�x���΃��|�o�^�Ҍ����A���P�[�g,2024/1/23 20:55,,50��,���l��,������,�ړI��d�g�݂��悭�킩��Ȃ�,,,,,,,���T�����炦��i�L�O�i��s�̎{�ݗ��p���Ȃǁj,,,,,,,,,,,,,,,,,,,,,,,,,,,,,,,,,,,�ǂ��炩�Ƃ����΂����d�g�݂��Ǝv��,���Ԃ�����ΎQ��������,�ǂ��炩�Ƃ����΂����d�g�݂��Ǝv��,�ω��͂Ȃ�����,�g�������Ƃ��Ȃ���Q23��,,,,,,
�ߘa�T�N�x���΃��|�o�^�Ҍ����A���P�[�g,2024/1/23 20:14,,40��,������,������,�ړI��d�g�݂��悭�킩��Ȃ�,,,,,,,���΃��|�̎d�g�݂�o�^���@�E������@�Ȃǂ𒼐ڋ����Ă��炦��i���΃��|�����A�s���o�O�u���Ȃǁj,,,,,,,,,,,,,,,,,,,,,,,,,,,,,,,,,,,�����d�g�݂��Ǝv��,���Ԃ�����ΎQ��������,�����d�g�݂��Ǝv��,�ǂ��炩�Ƃ����Εω���������,�ǂ��炩�Ƃ����Ύg���₷����Q23��,,,,,,
�ߘa�T�N�x���΃��|�o�^�Ҍ����A���P�[�g,2024/1/23 15:05,,50��,��ы�,������,�ړI��d�g�݂��悭�킩��Ȃ�,,,,,,,���΃��|�̎d�g�݂�o�^���@�E������@�Ȃǂ𒼐ڋ����Ă��炦��i���΃��|�����A�s���o�O�u���Ȃǁj,,,,,,,,,,,,,,,,,,,,,,,,,,,,,,,,,,,�ǂ��炩�Ƃ����΂����d�g�݂��Ǝv��,���Ԃ�����ΎQ��������,�ǂ��炩�Ƃ����΂����d�g�݂��Ǝv��,�ǂ��炩�Ƃ����Εω��͂Ȃ�����,�g�������Ƃ��Ȃ���Q23��,,,,,,
�ߘa�T�N�x���΃��|�o�^�Ҍ����A���P�[�g,2024/1/23 11:42,,70��ȏ�,��ы�,�͂���Q4��,,,,,,,,,,,,��������Q8��,,,,,,,,,,���|�[�g����ۑ肪�Ȃ�,���������|�[�g���Ȃ��Ă��s���Ή����Ă����,,��������Q13��,,,,,,������,���|�[�g�������Ǝv���悤�ȃe�[�}���Ȃ�,,,,,������,���|�[�g����K�v���������Ȃ�,�����ŉ����ł���ۑ肪������Ȃ�,,,,�����d�g�݂��Ǝv��,���Ԃ�����ΎQ��������,�����d�g�݂��Ǝv��,�ǂ��炩�Ƃ����Εω���������,�g�������Ƃ��Ȃ���Q23��,,,,,,���ǂ���t�s�ƏZ���n��Â���iSL�̑��̎��{�w�����s���Ă���j�̂��߁A���̒n�抈���ɂ��ϋɓI�ɎQ�����邱�Ƃɂ��܂��B
�ߘa�T�N�x���΃��|�o�^�Ҍ����A���P�[�g,2024/1/23 7:38,,60��,�Ԍ����,������,�ړI��d�g�݂��悭�킩��Ȃ�,,,,,,,���T�����炦��i�L�O�i��s�̎{�ݗ��p���Ȃǁj,�������߃X�|�b�g�̏Љ�Ȃǂ̊y�����R���e���c������,,,,,,,,,,,,,,,,,,,,,,,,,,,,,,,,,,�����d�g�݂��Ǝv��,�Q���������Ȃ�,�����d�g�݂��Ǝv��,�ǂ��炩�Ƃ����Εω��͂Ȃ�����,�g�������Ƃ��Ȃ���Q23��,,,,,,
�ߘa�T�N�x���΃��|�o�^�Ҍ����A���P�[�g,2024/1/23 1:34,,50��,���l��,������,���|�[�g����K�v���������Ȃ�,,,,,,,���T�����炦��i�L�O�i��s�̎{�ݗ��p���Ȃǁj,�������߃X�|�b�g�̏Љ�Ȃǂ̊y�����R���e���c������,,,,,,,,,,,,,,,,,,,,,,,,,,,,,,,,,,�����d�g�݂��Ǝv��,�Q���������Ȃ�,�ǂ��炩�Ƃ����΂����d�g�݂��Ǝv��,�ǂ��炩�Ƃ����Εω��͂Ȃ�����,�g���₷����Q23��,,,,,,���ꂩ��͎U���̍ۂ͎s�����悭���āA�@�����΃��|�[�g���Ă݂悤�Ǝv���B
�ߘa�T�N�x���΃��|�o�^�Ҍ����A���P�[�g,2024/1/23 1:20,,50��,��t�s�O,������,���̑�(�o�^�����΂���),,,,,,,�������߃X�|�b�g�̏Љ�Ȃǂ̊y�����R���e���c������,,,,,,,,,,,,,,,,,,,,,,,,,,,,,,,,,,,�����d�g�݂��Ǝv��,���Ԃ�����ΎQ��������,�ǂ��炩�Ƃ����΂����d�g�݂��Ǝv��,�ǂ��炩�Ƃ����Εω���������,�ǂ��炩�Ƃ����Ύg���₷����Q23��,,,,,,
�ߘa�T�N�x���΃��|�o�^�Ҍ����A���P�[�g,2024/1/22 22:59,,70��ȏ�,��ы�,�͂���Q4��,,,,,,,,,,,,��������Q8��,,,,,,,,,,�ړI��d�g�݂��悭�킩��Ȃ�,,,��������Q13��,,,,,,������,�ړI��d�g�݂��悭�킩��Ȃ�,,,,,������,�ړI��d�g�݂��悭�킩��Ȃ�,,,,,�����d�g�݂��Ǝv��,���Ԃ�����ΎQ��������,�ǂ��炩�Ƃ����΂����d�g�݂��Ǝv��,�ǂ��炩�Ƃ����Εω���������,�g�������Ƃ��Ȃ���Q23��,,,,,,
�ߘa�T�N�x���΃��|�o�^�Ҍ����A���P�[�g,2024/1/22 19:14,,70��ȏ�,��ы�,�͂���Q4��,,,,,,,,,,,,��������Q8��,,,,,,,,,,�ړI��d�g�݂��悭�킩��Ȃ�,���|�[�g���@��������Ȃ�,,��������Q13��,,,,,,������,�ړI��d�g�݂��悭�킩��Ȃ�,���|�[�g���@���킩��Ȃ�,�e�[�}�ɂ��������Ⴊ������Ȃ�,�e�[�}���|�[�g������Ă��邱�Ƃ�m��Ȃ�����,,�͂���Q17��,,,,,,�ǂ��炩�Ƃ����΂����d�g�݂��Ǝv��,���Ԃ�����ΎQ��������,�����d�g�݂��Ǝv��,�ω��͂Ȃ�����,�g�������Ƃ��Ȃ���Q23��,,,,,,�悸�́A�׋����܂��B
�ߘa�T�N�x���΃��|�o�^�Ҍ����A���P�[�g,2024/1/22 18:56,,70��ȏ�,���l��,������,���|�[�g���Ă������̂Ȃ̂������ł͔��f���Â炢,���|�[�g����K�v���������Ȃ�,���|�[�g���邱�Ƃ��ʓ|,,,,,�������߃X�|�b�g�̏Љ�Ȃǂ̊y�����R���e���c������,,,,,,,,,,,,,,,,,,,,,,,,,,,,,,,,,,,�ǂ��炩�Ƃ����΂����d�g�݂��Ǝv��,�Q���������Ȃ�,�ǂ��炩�Ƃ����΂����d�g�݂��Ǝv��,�ǂ��炩�Ƃ����Εω��͂Ȃ�����,�g�������Ƃ��Ȃ���Q23��,,,,,,